My Tinderbox is working…

Yes, you heard it right. My tinderbox is working. Even now i don’t know why i was trying to setup a tinderbox after both Emily and Nags asked me to concentrate on Firefox automation. I felt it was almost done and just few more steps, i will be able to set it up. And that’s what finally happened 🙂

So in this post, i am going to mention about all issues i faced in setting up a tinderbox and steps to fix them.

Note :: If you are ever setting up a tinderbox, be prepared to see huge log files. Like once my compilation ran for few hours and produced a log file of size 15MB. And if you are stuck up, DON’T send the entire file. A tail of that file should do. In fact, you should be in a position to find out from while line the exact error starts.

Yeah before you start reading this
http://sp2hari.blogspot.com/2007/06/conquered-solaris.html and
http://sp2hari.blogspot.com/2007/06/tinderbox.html has instructions about how to setup Tinderbox in Solaris environment.

Ok the first error i got was

Building deps for jsinterp.c
cc -o jsinterp.o -c -DOSTYPE=\”SunOS5\” -DOSARCH=SunOS -DEXPORT_JS_API -DJS_USE_SAFE_ARENA -I../../dist/include -I../../dist/include/js -I../../dist/include/nspr -DMOZ_PNG_READ -DMOZ_PNG_WRITE -I../../dist/sdk/include -I. -KPIC -xlibmil -xstrconst -xbuiltin=%all -mt -DNDEBUG -DTRIMMED -xO4 -DMOZILLA_VERSION=\”1.9a7pre\” -DMOZILLA_VERSION_U=1.9a7pre -DSOLARIS=1 -DNSCAP_DISABLE_DEBUG_PTR_TYPES=1 -DD_INO=d_ino -DSTDC_HEADERS=1 -DHAVE_ST_BLKSIZE=1 -DHAVE_SIGINFO_T=1 -DHAVE_INT16_T=1 -DHAVE_INT32_T=1 -DHAVE_INT64_T=1 -DHAVE_UINT=1 -DHAVE_UINT_T=1 -DHAVE_UINT16_T=1 -DHAVE_DIRENT_H=1 -DHAVE_SYS_BYTEORDER_H=1 -DHAVE_GETOPT_H=1 -DHAVE_MEMORY_H=1 -DHAVE_UNISTD_H=1 -DHAVE_NL_TYPES_H=1 -DHAVE_MALLOC_H=1 -DHAVE_X11_XKBLIB_H=1 -DHAVE_SYS_STATVFS_H=1 -DHAVE_SYS_STATFS_H=1 -DHAVE_LIBM=1 -DHAVE_LIBDL=1 -DHAVE_LIBSOCKET=1 -DFUNCPROTO=15 -DHAVE_XSHM=1 -D_REENTRANT=1 -DHAVE_RANDOM=1 -DHAVE_STRERROR=1 -DHAVE_LCHOWN=1 -DHAVE_FCHMOD=1 -DHAVE_SNPRINTF=1 -DHAVE_MEMMOVE=1 -DHAVE_RINT=1 -DHAVE_STAT64=1 -DHAVE_LSTAT64=1 -DHAVE_FLOCKFILE=1 -DHAVE_LOCALTIME_R=1 -DHAVE_STRTOK_R=1 -DHAVE_LANGINFO_CODESET=1 -DVA_COPY=va_copy -DHAVE_VA_COPY=1 -DHAVE_I18N_LC_MESSAGES=1 -DMOZ_EMBEDDING_LEVEL_DEFAULT=1 -DMOZ_EMBEDDING_LEVEL_BASIC=1 -DMOZ_EMBEDDING_LEVEL_MINIMAL=1 -DMOZ_PHOENIX=1 -DMOZ_BUILD_APP=browser -DMOZ_XUL_APP=1 -DMOZ_DEFAULT_TOOLKIT=\”cairo-gtk2\” -DMOZ_WIDGET_GTK2=1 -DMOZ_ENABLE_XREMOTE=1 -DMOZ_THEBES=1 -DMOZ_CAIRO_GFX=1 -DMOZ_X11=1 -DMOZ_DISTRIBUTION_ID=\”org.mozilla\” -DMOZ_ENABLE_XFT=1 -DMOZ_ENABLE_PANGO=1 -DMOZ_ENABLE_COREXFONTS=1 -DMOZ_ENABLE_GNOMEUI=1 -DMOZ_EXTRA_X11CONVERTERS=1 -DOJI=1 -DIBMBIDI=1 -DMOZ_VIEW_SOURCE=1 -DACCESSIBILITY=1 -DMOZ_XPINSTALL=1 -DMOZ_JSLOADER=1 -DNS_PRINTING=1 -DNS_PRINT_PREVIEW=1 -DMOZ_NO_XPCOM_OBSOLETE=1 -DMOZ_XTF=1 -DMOZ_MATHML=1 -DMOZ_ENABLE_CANVAS=1 -DMOZ_SVG=1 -DMOZ_SVG_FOREIGNOBJECT=1 -DMOZ_UPDATE_CHANNEL=default -DMOZ_PLACES=1 -DMOZ_PLACES_BOOKMARKS=1 -DMOZ_FEEDS=1 -DMOZ_STORAGE=1 -DMOZ_SAFE_BROWSING=1 -DMOZ_URL_CLASSIFIER=1 -DMOZ_LOGGING=1 -DMOZ_USER_DIR=\”.mozilla\” -DMOZ_ENABLE_LIBXUL=1 -DHAVE_STDINT_H=1 -DHAVE_INTTYPES_H=1 -DHAVE_SYS_INT_TYPES_H=1 -DHAVE_UINT64_T=1 -DMOZ_XUL=1 -DMOZ_PROFILELOCKING=1 -DMOZ_RDF=1 -DMOZ_MORKREADER=1 -DMOZ_DLL_SUFFIX=\”.so\” -DXP_UNIX=1 -DUNIX_ASYNC_DNS=1 -DJS_THREADSAFE=1 -DMOZ_ACCESSIBILITY_ATK=1 -DATK_MAJOR_VERSION=1 -DATK_MINOR_VERSION=12 -DATK_REV_VERSION=3 -DMOZILLA_LOCALE_VERSION=\”1.9a1\” -DMOZILLA_REGION_VERSION=\”1.9a1\” -DMOZILLA_SKIN_VERSION=\”1.8\” -D_MOZILLA_CONFIG_H_ -DMOZILLA_CLIENT jsinterp.c
ube: error: Assert has been violated at ‘/set/venus/builds.intel-S2/nightly.Thu/intel-S2/lang/ube/graphs/src/scregion.c 305’.
cc: ube failed for jsinterp.c
gmake[4]: *** [jsinterp.o] Error 2
Dave from Sun china asked me use a patch for Sun Studio 11 Compiler C. I don’t have the link to the patch now but the patch id is 121016-05. I remember getting it from the sun website. So searching there should give you the link. The above patch was dependent on patch 120759-06. So installed patch 120759-06 first and then install the patch 121016-05.

Steps to add a patch in Solaris are given below. The commands are for patch 121016-05. Change the id according to the patch you are installing.

1. Download 121016-05.zip and extract the contents in your current directory
2. Login as root
3. root@home# patchadd 121016-05
Note :: If the above command doesn’t work, then try
root@home# patchadd . 121016-05

The above steps should install the patch in your system. To check whether the patch is installed properly, check the folder /var/sadm/patch/. You should see seperate directories for each patch you have installed. In my system here, the /var/sdm/patch is like
# cd /var/sadm/patch/
# ls
120759-06 121016-05

That fixed the above problem :).

The next error i got was

jsinterp.c
ir2hf: error: Ran out of memory
cc: ir2hf failed for jsinterp.c

Now this is a strange problem and which can be fixed without much issue. You need more RAM. My system had 768MB (512+256) RAM, but you need 1GB RAM to fix this issue. So next day i got 1GB RAM and never got this error back.
After that, i got many compilation errors. This happened because of some issue in the mozilla code. This generally never happens. I got errors in lines having inline. Anyway now i am not getting the error anymore. So i think the mozilla code is fixed now. 🙂

Finally i got an error saying,

gmake[3]: Leaving directory `/export/home/hari/tinderbox

/SunOS_5.11_Depend/mozilla’
gmake[2]: Leaving directory `/export/home/hari/tinderbox/SunOS_5.11_Depend/mozilla’
make[1]: Leaving directory `/export/home/hari/tinderbox/SunOS_5.11_Depend/mozilla’
firefox-bin built successfully.
firefox-bin built successfully.
firefox-bin binary exists, build successful.
Unable to find path to Talkback client. Proceeding as if Talkback was not installed.

Running regxpcom test …
Timeout = 120 seconds.
Begin: Fri Aug 24 08:08:37 2007
cmd = /export/home/hari/tinderbox/SunOS_5.11_Depend/mozilla//dist/bin/firefox-bin -register
End: Fri Aug 24 08:08:38 2007
———– Output from regxpcom ————-
———– End Output from regxpcom ———
regxpcom: test failed
No profile found, creating profile.
Begin: Fri Aug 24 08:08:38 2007
cmd = /export/home/hari/tinderbox/SunOS_5.11_Depend/mozilla//dist/bin/firefox-bin -CreateProfile default
End: Fri Aug 24 08:08:39 2007
———– Output from Profile Creation ————-
Xlib: connection to “:0.0” refused by server
Xlib: No protocol specified

(firefox-bin:6432): Gtk-WARNING **: cannot open display:
———– End Output from Profile Creation ———
ERROR: profile /export/home/hari/tinderbox/SunOS_5.11_Depend/.mozilla/firefox/ does not exist
no pref file found

The solution for the above bug was to allow connections to X server. This is done by executing the following command before starting a tinderbox compilation. Remember the user who is running the tinderbox should execute the command.

hari@home:~$/usr/openwin/bin/xhost +
access control disabled, clients can connect from any host

Few other things to note while trying to compile firefox under tinderbox are
1. Never ever run two instances of tinderbox at the same time. Make sure the first one is killed before starting a new one.
2. Delete the SunOS_5.11_Depend folder when you are facing any compilation errors.
3. Use -XO3 for CFLAGS and CXXFLAGS
4. Make sure your mozconfig file has these lines
ac_add_options –disable-freetype2
ac_add_options –disable-debug
ac_add_options –disable-tests

Leave a Reply

Your email address will not be published. Required fields are marked *

This site uses Akismet to reduce spam. Learn how your comment data is processed.